Creator
type: Concept
preferred label: Autor @cs
in scheme: AgentRole
top concept of: AgentRole
definition: Hlavní tvůrci (výzkumníci) zapojení do tvorby dat nebo autoři publikace, v pořadí podle priority. U přístrojů se jedná o výrobce nebo vývojáře přístroje. Chcete-li uvést více tvůrců, uveďte tuto roli opakovaně. @cs
definition: The main researchers involved in producing the data, or the authors of the publication, in priority order. For instruments this is the manufacturer or developer of the instrument. To supply multiple creators, repeat this property.