Vydavatel
type: Concept
preferred label: Publisher @en
in scheme: AgentRole
top concept of: AgentRole
definition: Název subjektu, který zdroj uchovává, archivuje, publikuje, distribuuje, zveřejňuje, vydává nebo produkuje. Tento popisný údaj slouží následně k citování a žádosti o DOI, proto je třeba zvážit určení této role.
definition: The name of the entity that holds, archives, publishes, prints, distributes, releases, issues, or produces the resource. This property will be used to formulate the citation, so consider the prominence of the role. @en