Contributor
preferred label: Přispěvatel @cs
type: Concept
narrower: Data Collector

Data Collector
preferred label: Sběratel dat @cs
in scheme: AgentRole
broader: Contributor
definition: Person/institution responsible for finding or gathering/collecting data under the guidelines of the author(s) or Principal Investigator (PI). May also be used when crediting survey conductors, interviewers, event or condition observers, or persons responsible for monitoring key instrument data.
definition: Osoba/instituce odpovědná za vyhledávání nebo shromažďování dat podle pokynů autora/autorek nebo hlavního řešitele. Lze také použít pro autory průzkumu, tazatele, pozorovatele událostí nebo podmínek nebo osob odpovědných za monitorování klíčových dat z přístrojů. @cs
type: Concept