Editor
in scheme: AgentRole
broader: Contributor
definition: A person who oversees the details related to the publication format of the resource. Note: if the Editor is to be credited in place of multiple creators, the Editor’s name may be supplied as Creator, with “(Ed.)” appended to the name.
definition: Osoba, která dohlíží na detaily týkající se publikačního formátu zdroje. Poznámka: Pokud má být editor uveden místo více tvůrců, může být uveden i jako tvůrce s připojeným „(Ed.)“ za jménem. @cs
type: Concept

Contributor
preferred label: Přispěvatel @cs
type: Concept
narrower: Editor