Contributor
preferred label: Přispěvatel @cs
type: Concept
narrower: Producer

Producer
preferred label: Producent @cs
in scheme: AgentRole
broader: Contributor
definition: Typically, a person or organisation responsible for the artistry and form of a media product. In the data industry, this may be a company “producing” DVDs that package data for future dissemination by a distributor.
definition: Obvykle osoba nebo organizace zodpovědná za umělecké zpracování a formu mediálního produktu. V datovém průmyslu se může jednat o společnost „produkující“ DVD pro budoucí šíření distributorem. @cs
type: Concept