Project Leader
preferred label: Vedoucí projektu @cs
in scheme: AgentRole
broader: Contributor
definition: Person officially designated as head of project team or sub- project team instrumental in the work necessary to development of the resource. The Project Leader is not “removed” from the work that resulted in the resource; he or she remains intimately involved throughout the life of the particular project team.
definition: Osoba, která je oficiálně vedoucím projektového týmu nebo dílčího projektového týmu a podílí se na práci nezbytné pro vývoj zdroje. Vedoucí projektu zůstává úzce zapojen do práce po celou dobu existence daného projektového týmu. @cs
type: Concept

Contributor
preferred label: Přispěvatel @cs
type: Concept
narrower: Project Leader