Project Manager
preferred label: Projektový manažer @cs
in scheme: AgentRole
broader: Contributor
definition: Person officially designated as manager of a project. Project may consist of one or many project teams and sub-teams. The manager of a project normally has more administrative responsibility than actual work involvement.
definition: Osoba, která je oficiálně manažerem projektu. Projekt se může skládat z jednoho nebo více projektových týmů a podtýmů. Manažer projektu má obvykle více administrativní odpovědnosti než skutečné pracovní účasti. @cs
type: Concept

Contributor
preferred label: Přispěvatel @cs
type: Concept
narrower: Project Manager