Project Member
preferred label: Člen projektového týmu @cs
in scheme: AgentRole
broader: Contributor
definition: Person on the membership list of a designated project/project team. This vocabulary may or may not indicate the quality, quantity, or substance of the person’s involvement.
definition: Člen určitého projektu/projektového týmu. Tento slovník neupřesňuje míru zapojení dané osoby. @cs
type: Concept

Contributor
preferred label: Přispěvatel @cs
type: Concept
narrower: Project Member