Research Group
preferred label: Výzkumná skupina @cs
in scheme: AgentRole
broader: Contributor
definition: Typically refers to a group of individuals with a lab, department, or division that has a specifically defined focus of activity. May operate at a narrower level of scope; may or may not hold less administrative responsibility than a project team.
definition: Obvykle se vztahuje na skupinu jednotlivců, pracující v určité laboratoři, oddělení nebo divizi, která má specificky definované zaměření činnosti. Může fungovat v užším rozsahu; může, ale nemusí mít menší administrativní odpovědnost než projektový tým. @cs
type: Concept

Contributor
preferred label: Přispěvatel @cs
type: Concept
narrower: Research Group