Contributor
preferred label: Přispěvatel @cs
type: Concept
narrower: Supervisor

Supervisor
preferred label: Supervizor @cs
in scheme: AgentRole
broader: Contributor
definition: Určený supervizor nad jednou nebo více skupinami/týmy pracujícími na tvorbě zdroje nebo nad jedním či více kroky vývojového procesu. @cs
definition: Designated administrator over one or more groups/teams working to produce a resource, or over one or more steps of a development process.
type: Concept