Contributor
preferred label: Přispěvatel @cs
type: Concept
narrower: Translator

Translator
preferred label: Překladatel @cs
in scheme: AgentRole
broader: Contributor
definition: A person, organization, or automated system responsible for converting the content of a resource from one language into another, preserving its meaning and intended message. This contributor type should be applied to DOI metadata for a resource which has been translated from another resource.
definition: Osoba, organizace nebo systém zodpovědný za převod obsahu zdroje z jednoho jazyka do jiného, ​​přičemž zachovává jeho význam a zamýšlené sdělení. Tento typ přispěvatele by měl být použit pro metadata DOI pro zdroj, který byl přeložen z jiného zdroje. @cs
type: Concept