Work Package Leader
preferred label: Vedoucí pracovního balíku @cs
in scheme: AgentRole
broader: Contributor
definition: Pracovní balíček je uznaný datový produkt, jehož celý obsah nemusí být zahrnut v publikaci. Balíček může však zahrnovat například poznámky, vyřazené dokumenty apod. Vedoucí pracovního balíčku je odpovědný za zajištění úplnosti obsahu, verzování a dostupnost pracovního balíčku během vývoje daného zdroje. @cs
definition: A Work Package is a recognized data product, not all of which is included in publication. The package, instead, may include notes, discarded documents, etc. The Work Package Leader is responsible for ensuring the comprehensive contents, versioning, and availability of the Work Package during the development of the resource.
type: Concept

Contributor
preferred label: Přispěvatel @cs
type: Concept
narrower: Work Package Leader