Description Type
title: Typ popisu @cs
has top concept: Technical Info
has top concept: Table Of Contents
has top concept: Series Information
has top concept: Other
has top concept: Methods
has top concept: Abstract
type: ConceptScheme

Table Of Contents
preferred label: Obsah @cs
in scheme: Description Type
top concept of: Description Type
definition: Obsah zdroje. @cs
definition: A listing of the Table of Contents.
type: Concept

Abstract
preferred label: Abstrakt @cs
in scheme: Description Type
top concept of: Description Type
definition: Stručný popis zdroje a kontextu, v jehož rámci zdroj vznikl. @cs
definition: A brief description of the resource and the context in which the resource was created.
type: Concept

Methods
preferred label: Metodologie @cs
in scheme: Description Type
top concept of: Description Type
definition: Metodologie použitá pro studii nebo výzkum. @cs
definition: The methodology employed for the study or research.
type: Concept

Series Information
preferred label: Informace o sérii @cs
in scheme: Description Type
top concept of: Description Type
definition: Informace o sérii, například svazek a číslo. @cs
definition: Information about a repeating series, such as volume, issue, number.
type: Concept

Technical Info
preferred label: Technická informace @cs
in scheme: Description Type
top concept of: Description Type
definition: Podrobné informace, které mohou souviset s návrhem, implementací, provozem, použitím a/nebo údržbou systému nebo přístroje nebo jiným nastavením procesu získání či ověření datasetu či jiného zdroje. @cs
definition: Detailed information that may be associated with design, implementation, operation, use, and/or maintenance of a process, system, or instrument.
type: Concept

Other
preferred label: Jiný @cs
in scheme: Description Type
top concept of: Description Type
definition: Další popisné informace, které nelze zařadit do existující kategorie. @cs
definition: Other description information that does not fit into an existing category.
type: Concept