Obsah
type: Concept
definition: Obsah zdroje.
definition: A listing of the Table of Contents. @en
in scheme: Typ popisu
preferred label: Table Of Contents @en
top concept of: Typ popisu

Technická informace
type: Concept
definition: Podrobné informace, které mohou souviset s návrhem, implementací, provozem, použitím a/nebo údržbou systému nebo přístroje nebo jiným nastavením procesu získání či ověření datasetu či jiného zdroje.
definition: Detailed information that may be associated with design, implementation, operation, use, and/or maintenance of a process, system, or instrument. @en
in scheme: Typ popisu
preferred label: Technical Info @en
top concept of: Typ popisu

Jiný
type: Concept
definition: Další popisné informace, které nelze zařadit do existující kategorie.
definition: Other description information that does not fit into an existing category. @en
in scheme: Typ popisu
preferred label: Other @en
top concept of: Typ popisu

Metodologie
type: Concept
definition: Metodologie použitá pro studii nebo výzkum.
definition: The methodology employed for the study or research. @en
in scheme: Typ popisu
preferred label: Methods @en
top concept of: Typ popisu

Typ popisu
type: ConceptScheme
title: Description Type @en
has top concept: Technická informace
has top concept: Obsah
has top concept: Informace o sérii
has top concept: Jiný
has top concept: Metodologie
has top concept: Abstrakt

Abstrakt
type: Concept
definition: Stručný popis zdroje a kontextu, v jehož rámci zdroj vznikl.
definition: A brief description of the resource and the context in which the resource was created. @en
in scheme: Typ popisu
preferred label: Abstract @en
top concept of: Typ popisu

Informace o sérii
type: Concept
definition: Informace o sérii, například svazek a číslo.
definition: Information about a repeating series, such as volume, issue, number. @en
in scheme: Typ popisu
preferred label: Series Information @en
top concept of: Typ popisu