Refers to the location
type: Concept
definition: This is a relationship to a location that relates to the content of the data. The dataset contains data about the given location.
definition: Jedná se o vztah k lokaci, které se týkají obsahově daná data. Dataset obsahuje data o dané lokaci. @cs
in scheme: Location Relation
preferred label: Týká se lokace @cs
top concept of: Location Relation

Processed at location
type: Concept
definition: This is the determination of the location where the data was further processed after collection or measurement.
definition: Jedná se o určení lokace, kde byla daná data po sběru či naměření dále zpracována. @cs
in scheme: Location Relation
preferred label: Zpracováno v lokaci @cs
top concept of: Location Relation

Collected in
type: Concept
definition: This is the determination of the location where the data was collected (measured, recorded, observed etc.).
definition: Jedná se o určení lokace, kde byla daná data zaznamenána (naměřena, sesbírána...). @cs
in scheme: Location Relation
preferred label: Získáno v lokaci @cs
top concept of: Location Relation

Location Relation
type: ConceptScheme
title: Vztah k lokaci @cs
has top concept: Stored at location
has top concept: Refers to the location
has top concept: Processed at location
has top concept: Other
has top concept: Collected in

Stored at location
type: Concept
definition: This is the determination of the location where the data is permanently stored after collection, measurement or processing.
definition: Jedná se o určení lokace, kde byla daná data po sběru, naměření či zpracování uložena a jsou trvale uchovávána. @cs
in scheme: Location Relation
preferred label: Uchováno v lokaci @cs
top concept of: Location Relation

Other
type: Concept
in scheme: Location Relation
preferred label: Jiné @cs
top concept of: Location Relation