Date Available
preferred label: Datum zveřejnění @cs
in scheme: TimeReference
top concept of: TimeReference
definition: The date the resource is made publicly available. May be a range. To indicate the end of an embargo period, use Available.
definition: Datum, kdy je zdroj zpřístupněn veřejnosti. Může se jednat o časové rozmezí. Užívejte i pro označení konce období embarga. @cs
type: Concept