Date Collected
preferred label: Datum sběru @cs
in scheme: TimeReference
top concept of: TimeReference
definition: The date or date range in which the resource content was collected. To indicate precise or particular timeframes in which research was conducted.
definition: Datum nebo časové rozmezí, kdy byl obsah zdroje posbírán. Pro uvedení přesného časového rozmezí, ve kterém byl výzkum proveden. @cs
type: Concept