Date Coverage
preferred label: Časové pokrytí @cs
in scheme: TimeReference
top concept of: TimeReference
definition: The date or date range that the resource content applies to, describes, or covers. To indicate the temporal coverage of the resource, use Coverage. This may be different from Collected.
definition: Datum nebo časové rozmezí, ke kterému se zdroj obsahově vztahuje, popisuje ho nebo jinak pokrývá. Chcete-li uvést časové rozmezí, použijte Časové pokrytí. Liší se od Data sběru (Date Collected). @cs
type: Concept