Other date
preferred label: Jiné datum @cs
in scheme: TimeReference
top concept of: TimeReference
definition: Jiná datace, která se vztahuje ke zdroji a nepatří do existující kategorie. @cs
definition: Other date that does not fit into an existing category.
type: Concept