Date Submitted
preferred label: Datum podání @cs
in scheme: TimeReference
top concept of: TimeReference
definition: The date the creator submits the resource to the publisher. This could be different from Accepted if the publisher then applies a selection process. Recommended for discovery.
definition: Datum, kdy tvůrce odešle (odevzdá) zdroj vydavateli. Toto datum se může lišit od Data přijetí, pokud vydavatel následně uplatní recenzní proces nebo jiný proces výběru. Doporučeno použít pro lepší vyhledávání. @cs
type: Concept