Date Withdrawn
preferred label: Datum odstranění @cs
in scheme: TimeReference
top concept of: TimeReference
definition: The date the resource is removed. It is good practice to include a description that indicates the reason for the retraction or withdrawal.
definition: Datum odstranění zdroje. Je vhodné uvést důvod odstranění. @cs
type: Concept